{"text_format":"1","workbook":"xlsx","n_sheets":7,"sheets":["Global_Simulation_Parameters","Facility_List","Composition","InternalUseOnly_Feedbacks","InternalUseOnly_FeedbackFormula","InternalUseOnly_CondFormat","InternalUseOnly_Validation"],"not_rendered":{"charts":0,"images":0,"macros":1,"external_links":0,"defined_names":0,"comments":3,"pivot_tables":0},"unopened":[],"bounds":{"document_bytes":16777216,"sheet_cells":100000,"rows_first":2000,"rows_last":500,"rows_between":2000,"halvings":0,"cell_chars":16384,"cell_head_chars":4096},"cells_cut":0,"cells_raw":0,"read":"whole","date_system":"1900"}

{"sheet":"Global_Simulation_Parameters","index":0,"n_rows":1,"n_cols":2,"rows_kept":1,"cut":false,"hidden":false,"merged":[]}
["Output Directory","output/Thermodynamics"]

{"sheet":"Facility_List","index":1,"n_rows":1,"n_cols":11,"rows_kept":1,"cut":false,"hidden":true,"merged":[]}
["Facility_ID","Latitude","Longitude","Region","Sector","Leak Emission Data Source","Leak Survey Method","Filename for User Specified Leaks","Pneumatic Data Source","Reporting Year","Composition Profile ID"]

{"sheet":"Composition","index":2,"n_rows":7,"n_cols":20,"rows_kept":7,"cut":false,"hidden":false,"merged":[]}
["Composition Profile ID","Composition Data Source","Condensate (or OIL) formation","Number of Separator Stages","API Gravity","Gas to Oil Ratio [scf/bbl]","Temperature [F]","1st Stage Pressure [psia]","2nd Stage Pressure [psia]","Methane [molar fraction]","Ethane [molar fraction]","Propane [molar fraction]","Butane [molar fraction]","Isobutane [molar fraction]","Pentane [molar fraction]","Isopentane [molar fraction]","Hexanes [molar fraction]","CO2 [molar fraction]","N2 [molar fraction]","H2S [molar fraction]"]
["Composition_1","thermodynamics","no",1,null,null,84,458,null,0.97909999999999997,1.29E-2]
["Composition_2","thermodynamics","no",1,null,null,77,21,null,0.98340000000000005,1.0999999999999999E-2]
["Composition_3","thermodynamics","no",1,null,null,78,1399,null,0.98309999999999997,1.1900000000000001E-2]
["Composition_4","thermodynamics","yes",1,45.9,8114,67,1089,null,0.84470000000000001,0.1278]
["Composition_5","thermodynamics","yes",1,46.5,3772,119,null,null,0.80840000000000001,0.1176]
["Composition_6","thermodynamics","yes",1,53.1,14319,null,500,null,0.8085,0.12909999999999999]

{"sheet":"InternalUseOnly_Feedbacks","index":3,"n_rows":3234,"n_cols":9,"rows_kept":3234,"cut":false,"hidden":true,"merged":[]}
[null,"FIPS","County","State","County_State",null,null,"Basin ID AAPG","Neme"]
[{"$f":"E2","v":"Autauga, AL"},1001,"Autauga","AL",{"$f":"C2&\", \"&D2","v":"Autauga, AL"},null,{"$f":"I2","v":"New England Province"},100,"New England Province"]
[{"$f":"E3","v":"Baldwin, AL"},1003,"Baldwin","AL",{"$f":"C3&\", \"&D3","v":"Baldwin, AL"},null,{"$f":"I3","v":"Adirondack Uplift"},110,"Adirondack Uplift"]
["Barbour, AL",1005,"Barbour","AL","Barbour, AL",null,"Atlantic Coast Basin",120,"Atlantic Coast Basin"]
["Bibb, AL",1007,"Bibb","AL","Bibb, AL",null,"S.GA Sedimentary Prov",130,"S.GA Sedimentary Prov"]
["Blount, AL",1009,"Blount","AL","Blount, AL",null,"Florida Platform",140,"Florida Platform"]
["Bullock, AL",1011,"Bullock","AL","Bullock, AL",null,"Piedmont-Blue Ridge Prov",150,"Piedmont-Blue Ridge Prov"]
["Butler, AL",1013,"Butler","AL","Butler, AL",null,"Appalachian Basin",160,"Appalachian Basin"]
["Calhoun, AL",1015,"Calhoun","AL","Calhoun, AL",null,"Appalachian Basin (Eastern Overthrust Area)","160A","Appalachian Basin (Eastern Overthrust Area)"]
["Chambers, AL",1017,"Chambers","AL","Chambers, AL",null,"Black Warrior Basin",200,"Black Warrior Basin"]
["Cherokee, AL",1019,"Cherokee","AL","Cherokee, AL",null,"Mid-Gulf Coast Basin",210,"Mid-Gulf Coast Basin"]
["Chilton, AL",1021,"Chilton","AL","Chilton, AL",null,"Gulf Coast Basin (LA, TX)",220,"Gulf Coast Basin (LA, TX)"]
["Choctaw, AL",1023,"Choctaw","AL","Choctaw, AL",null,"Arkla Basin",230,"Arkla Basin"]
["Clarke, AL",1025,"Clarke","AL","Clarke, AL",null,"Desha Basin",240,"Desha Basin"]
["Clay, AL",1027,"Clay","AL","Clay, AL",null,"Upper Mississippi Embaymnt",250,"Upper Mississippi Embaymnt"]
["Cleburne, AL",1029,"Cleburne","AL","Cleburne, AL",null,"East Texas Basin",260,"East Texas Basin"]
["Coffee, AL",1031,"Coffee","AL","Coffee, AL",null,"Cincinnati Arch",300,"Cincinnati Arch"]
["Colbert, AL",1033,"Colbert","AL","Colbert, AL",null,"Michigan Basin",305,"Michigan Basin"]
["Conecuh, AL",1035,"Conecuh","AL","Conecuh, AL",null,"Wisconsin Arch",310,"Wisconsin Arch"]
["Coosa, AL",1037,"Coosa","AL","Coosa, AL",null,"Illinois Basin",315,"Illinois Basin"]
["Covington, AL",1039,"Covington","AL","Covington, AL",null,"Sioux Uplift",320,"Sioux Uplift"]
["Crenshaw, AL",1041,"Crenshaw","AL","Crenshaw, AL",null,"Iowa Shelf",325,"Iowa Shelf"]
["Cullman, AL",1043,"Cullman","AL","Cullman, AL",null,"Lincoln Anticline",330,"Lincoln Anticline"]
["Dale, AL",1045,"Dale","AL","Dale, AL",null,"Forest City Basin",335,"Forest City Basin"]
["Dallas, AL",1047,"Dallas","AL","Dallas, AL",null,"Ozark Uplift",340,"Ozark Uplift"]
["DeKalb, AL",1049,"DeKalb","AL","DeKalb, AL",null,"Arkoma Basin",345,"Arkoma Basin"]
["Elmore, AL",1051,"Elmore","AL","Elmore, AL",null,"South Oklahoma Folded Belt",350,"South Oklahoma Folded Belt"]
["Escambia, AL",1053,"Escambia","AL","Escambia, AL",null,"Chautauqua Platform",355,"Chautauqua Platform"]
["Etowah, AL",1055,"Etowah","AL","Etowah, AL",null,"Anadarko Basin",360,"Anadarko Basin"]
["Fayette, AL",1057,"Fayette","AL","Fayette, AL",null,"Cherokee Basin",365,"Cherokee Basin"]
["Franklin, AL",1059,"Franklin","AL","Franklin, AL",null,"Nemaha Anticline",370,"Nemaha Anticline"]
["Geneva, AL",1061,"Geneva","AL","Geneva, AL",null,"Sedgwick Basin",375,"Sedgwick Basin"]
["Greene, AL",1063,"Greene","AL","Greene, AL",null,"Salina Basin",380,"Salina Basin"]
["Hale, AL",1065,"Hale","AL","Hale, AL",null,"Central Kansas Uplift",385,"Central Kansas Uplift"]
["Henry, AL",1067,"Henry","AL","Henry, AL",null,"Chadron Arch",390,"Chadron Arch"]
["Houston, AL",1069,"Houston","AL","Houston, AL",null,"Williston Basin",395,"Williston Basin"]
["Jackson, AL",1071,"Jackson","AL","Jackson, AL",null,"Ouachita Folded Belt",400,"Ouachita Folded Belt"]
["Jefferson, AL",1073,"Jefferson","AL","Jefferson, AL",null,"Kerr Basin",405,"Kerr Basin"]
["Lamar, AL",1075,"Lamar","AL","Lamar, AL",null,"Llano Uplift",410,"Llano Uplift"]
["Lauderdale, AL",1077,"Lauderdale","AL","Lauderdale, AL",null,"Strawn Basin",415,"Strawn Basin"]
["Lawrence, AL",1079,"Lawrence","AL","Lawrence, AL",null,"Fort Worth Syncline",420,"Fort Worth Syncline"]
["Lee, AL",1081,"Lee","AL","Lee, AL",null,"Bend Arch",425,"Bend Arch"]
["Limestone, AL",1083,"Limestone","AL","Limestone, AL",null,"Permian Basin",430,"Permian Basin"]
["Lowndes, AL",1085,"Lowndes","AL","Lowndes, AL",null,"Palo Duro Basin",435,"Palo Duro Basin"]
["Macon, AL",1087,"Macon","AL","Macon, AL",null,"Sierra Grande Uplift",445,"Sierra Grande Uplift"]
["Madison, AL",1089,"Madison","AL","Madison, AL",null,"Las Animas Arch",450,"Las Animas Arch"]
["Marengo, AL",1091,"Marengo","AL","Marengo, AL",null,"Las Vegas-Raton Basin",455,"Las Vegas-Raton Basin"]
["Marion, AL",1093,"Marion","AL","Marion, AL",null,"Estancia Basin",460,"Estancia Basin"]
["Marshall, AL",1095,"Marshall","AL","Marshall, AL",null,"Orogrande Basin",465,"Orogrande Basin"]
["Mobile, AL",1097,"Mobile","AL","Mobile, AL",null,"Pedregosa Basin",470,"Pedregosa Basin"]
["Monroe, AL",1099,"Monroe","AL","Monroe, AL",null,"Basin-And-Range Province",475,"Basin-And-Range Province"]
["Montgomery, AL",1101,"Montgomery","AL","Montgomery, AL",null,"Sweetgrass Arch",500,"Sweetgrass Arch"]
["Morgan, AL",1103,"Morgan","AL","Morgan, AL",null,"North Western Overthrust",503,"North Western Overthrust"]
["Perry, AL",1105,"Perry","AL","Perry, AL",null,"Montana Folded Belt",505,"Montana Folded Belt"]
["Pickens, AL",1107,"Pickens","AL","Pickens, AL",null,"Central Western Overthrust",507,"Central Western Overthrust"]
["Pike, AL",1109,"Pike","AL","Pike, AL",null,"South Western Overthrust",509,"South Western Overthrust"]
["Randolph, AL",1111,"Randolph","AL","Randolph, AL",null,"Central Montana Uplift",510,"Central Montana Uplift"]
["Russell, AL",1113,"Russell","AL","Russell, AL",null,"Powder River Basin",515,"Powder River Basin"]
["St. Clair, AL",1115,"St. Clair","AL","St. Clair, AL",null,"Big Horn Basin",520,"Big Horn Basin"]
["Shelby, AL",1117,"Shelby","AL","Shelby, AL",null,"Yellowstone Province",525,"Yellowstone Province"]
{"$rows_left_out":3175}
{"sheet":"InternalUseOnly_FeedbackFormula","index":4,"n_rows":8,"n_cols":3,"rows_kept":8,"cut":false,"hidden":true,"merged":[]}
["Sheet","Excel Column","Formula"]
["Wells","FIPS County Identifier","=VLOOKUP($E2,InternalUseOnly_Feedbacks!$A$2:$E$3234,2,FALSE)"]
["Wells","Basin ID GHGRP AAPG","=VLOOKUP($T2,InternalUseOnly_Feedbacks!$G$2:$I$113,2,FALSE)"]
["Wellpad_TankFlash","Tank Flash Properties Data Source","=VLOOKUP($B2,Wells!$A:$AV,MATCH(E$1,Wells!$1:$1,0),FALSE)"]
["Wellpad_Pneumatics","Pneumatic Controller Activity Factor Data Source","=VLOOKUP($B2,Wells!$A:$AV,MATCH(D$1,Wells!$1:$1,0),FALSE)"]
["Wellpad_Pneumatics","Pneumatic Controller Emission Factor Data Source","=VLOOKUP($B2,Wells!$A:$AV,MATCH(E$1,Wells!$1:$1,0),FALSE)"]
["Wellpad_ChemicalInjectionPump","Chemical Injection Pump Activity Factor Data Source","=VLOOKUP($B2,Wells!$A:$AV,MATCH(D$1,Wells!$1:$1,0),FALSE)"]
["Wellpad_ChemicalInjectionPump","Chemical Injection Pump Emission Factor Data Source","=VLOOKUP($B2,Wells!$A:$AV,MATCH(E$1,Wells!$1:$1,0),FALSE)"]

{"sheet":"InternalUseOnly_CondFormat","index":5,"n_rows":202,"n_cols":20,"rows_kept":202,"cut":false,"hidden":true,"merged":[]}
["Sheet","Excel Column","Depends","op","value","result",null,null,"c_tgt_manual_excemple","c_src_manual_example","c_tgt","c_src","op","val","result"]
["Facility_List","Leak Survey Method","Leak Emission Data Source","=","U.S. EPA Greenhouse Gas Reporting Program (GHGRP)","mandatory",null,null,null,null,{"$f":"MATCH($B2,INDIRECT(\"'\"&$A2&\"'!$1:$1\"),0)","v":7},{"$f":"MATCH($C2,INDIRECT(\"'\"&$A2&\"'!$1:$1\"),0)","v":6},{"$f":"D2","v":"="},{"$f":"E2","v":"U.S. EPA Greenhouse Gas Reporting Program (GHGRP)"},{"$f":"F2","v":"mandatory"}]
[null,null,null,null,null,null,null,null,null,null,{"$error":"#REF!"},{"$error":"#REF!"},{"$f":"D3","v":0},0,0]
["Facility_List","Filename for User Specified Leaks","Leak Emission Data Source","=","User specified","mandatory",null,null,null,null,8,6,{"$f":"D4","v":"="},"User specified","mandatory"]
[null,null,null,null,null,null,null,null,null,null,{"$error":"#REF!"},{"$error":"#REF!"},{"$f":"D5","v":0},0,0]
["Composition","Condensate (or OIL) formation","Composition Data Source","=","thermodynamics","mandatory",null,null,{"$f":"MATCH($B6,Composition!$1:$1,0)","v":3},{"$f":"MATCH($C6,Composition!$1:$1,0)","v":2},3,2,{"$f":"D6","v":"="},{"$f":"E6","v":"thermodynamics"},"mandatory",null,"How to use:"]
["Composition","Number of Separator Stages","Composition Data Source","=","thermodynamics","mandatory",null,null,null,null,4,2,{"$f":"D7","v":"="},{"$f":"E7","v":"thermodynamics"},{"$f":"F7","v":"mandatory"},null,null,"Fill Columns A:F"]
["Composition","API Gravity","Composition Data Source","=","thermodynamics","mandatory",null,null,null,null,5,2,"=","thermodynamics","mandatory",null,null,null,"rule 1","All rules for one sheet should be define next each other,"]
["Composition","Gas to Oil Ratio [scf/bbl]","Composition Data Source","=","thermodynamics","mandatory",null,null,null,null,6,2,"=","thermodynamics","mandatory",null,null,null,null," i.e. don’t go somewhere and come back"]
["Composition","Temperature [F]","Composition Data Source","=","thermodynamics","mandatory",null,null,null,null,7,2,"=","thermodynamics","mandatory",null,null,null,"rule 2","One block shoud list contiguous set of columns"]
["Composition","1st Stage Pressure [psia]","Composition Data Source","=","thermodynamics","mandatory",null,null,null,null,8,2,"=","thermodynamics","mandatory",null,null,null,null,"i.e., if you have to skip columns for a given rule, create two rules"]
["Composition","2nd Stage Pressure [psia]","Composition Data Source","=","thermodynamics","mandatory",null,null,null,null,9,2,"=","thermodynamics","mandatory",null,null,null,"rule 3","columns D:F has to be identical within a block"]
[null,null,null,null,null,null,null,null,null,null,{"$error":"#REF!"},{"$error":"#REF!"},0,0,0,null,null,null,"rule 4","Rules are enforced by the rules below are overwrite the one above"]
["Composition","Condensate (or OIL) formation","Composition Data Source","<>","thermodynamics","disabled",null,null,null,null,3,2,"<>","thermodynamics","disabled",null,null,null,null,"So generic rule near the top, and then specific rules to be come near the end to overwrite"]
["Composition","Number of Separator Stages","Composition Data Source","<>","thermodynamics","disabled",null,null,null,null,4,2,"<>","thermodynamics","disabled"]
["Composition","API Gravity","Composition Data Source","<>","thermodynamics","disabled",null,null,null,null,5,2,"<>","thermodynamics","disabled",null,null,null,"pretty strict rule and high redundancy, but I preferred being explicit instead of getting cryptic"]
["Composition","Gas to Oil Ratio [scf/bbl]","Composition Data Source","<>","thermodynamics","disabled",null,null,null,null,6,2,"<>","thermodynamics","disabled"]
["Composition","Temperature [F]","Composition Data Source","<>","thermodynamics","disabled",null,null,null,null,7,2,"<>","thermodynamics","disabled",null,null,"Extend columns K:L to one row passed to the end of entries in A:F"]
["Composition","1st Stage Pressure [psia]","Composition Data Source","<>","thermodynamics","disabled",null,null,null,null,8,2,"<>","thermodynamics","disabled",null,null,null,"Caveate:","columnk K:L has =INDIRECT() function which may make excel file to be slow "]
["Composition","2nd Stage Pressure [psia]","Composition Data Source","<>","thermodynamics","disabled",null,null,null,null,9,2,"<>","thermodynamics","disabled",null,null,null,null,"if that happens, replace columns K:L with formala in I:J, but"]
[null,null,null,null,null,null,null,null,null,null,{"$error":"#REF!"},{"$error":"#REF!"},0,0,0,null,null,null,null,"each row you have to manually copy the name of sheet from columnA…"]
["Composition","Ethane [molar fraction]","Composition Data Source","=","thermodynamics","optional",null,null,null,null,11,2,"=","thermodynamics","optional",null,null,"Run macro set_cond_format"]
["Composition","Propane [molar fraction]","Composition Data Source","=","thermodynamics","optional",null,null,null,null,12,2,"=","thermodynamics","optional"]
[null,null,null,null,null,null,null,null,null,null,{"$error":"#REF!"},{"$error":"#REF!"},0,0,0]
["Composition","Butane [molar fraction]","Composition Data Source","=","thermodynamics","disabled",null,null,null,null,13,2,"=","thermodynamics","disabled"]
["Composition","Isobutane [molar fraction]","Composition Data Source","=","thermodynamics","disabled",null,null,null,null,14,2,"=","thermodynamics","disabled"]
["Composition","Pentane [molar fraction]","Composition Data Source","=","thermodynamics","disabled",null,null,null,null,15,2,"=","thermodynamics","disabled"]
["Composition","Isopentane [molar fraction]","Composition Data Source","=","thermodynamics","disabled",null,null,null,null,16,2,"=","thermodynamics","disabled"]
["Composition","Hexanes [molar fraction]","Composition Data Source","=","thermodynamics","disabled",null,null,null,null,17,2,"=","thermodynamics","disabled"]
["Composition","CO2 [molar fraction]","Composition Data Source","=","thermodynamics","disabled",null,null,null,null,18,2,"=","thermodynamics","disabled"]
["Composition","N2 [molar fraction]","Composition Data Source","=","thermodynamics","disabled",null,null,null,null,19,2,"=","thermodynamics","disabled"]
["Composition","H2S [molar fraction]","Composition Data Source","=","thermodynamics","disabled",null,null,null,null,20,2,"=","thermodynamics","disabled"]
[null,null,null,null,null,null,null,null,null,null,{"$error":"#REF!"},{"$error":"#REF!"},0,0,0]
["Composition","Ethane [molar fraction]","Composition Data Source","=","Cardoso 2019 correlation","disabled",null,null,null,null,11,2,"=","Cardoso 2019 correlation","disabled"]
["Composition","Propane [molar fraction]","Composition Data Source","=","Cardoso 2019 correlation","disabled",null,null,null,null,12,2,"=","Cardoso 2019 correlation","disabled"]
["Composition","Butane [molar fraction]","Composition Data Source","=","Cardoso 2019 correlation","disabled",null,null,null,null,13,2,"=","Cardoso 2019 correlation","disabled"]
["Composition","Isobutane [molar fraction]","Composition Data Source","=","Cardoso 2019 correlation","disabled",null,null,null,null,14,2,"=","Cardoso 2019 correlation","disabled"]
["Composition","Pentane [molar fraction]","Composition Data Source","=","Cardoso 2019 correlation","disabled",null,null,null,null,15,2,"=","Cardoso 2019 correlation","disabled"]
["Composition","Isopentane [molar fraction]","Composition Data Source","=","Cardoso 2019 correlation","disabled",null,null,null,null,16,2,"=","Cardoso 2019 correlation","disabled"]
["Composition","Hexanes [molar fraction]","Composition Data Source","=","Cardoso 2019 correlation","disabled",null,null,null,null,17,2,"=","Cardoso 2019 correlation","disabled"]
["Composition","CO2 [molar fraction]","Composition Data Source","=","Cardoso 2019 correlation","disabled",null,null,null,null,18,2,"=","Cardoso 2019 correlation","disabled"]
["Composition","N2 [molar fraction]","Composition Data Source","=","Cardoso 2019 correlation","disabled",null,null,null,null,19,2,"=","Cardoso 2019 correlation","disabled"]
["Composition","H2S [molar fraction]","Composition Data Source","=","Cardoso 2019 correlation","disabled",null,null,null,null,20,2,"=","Cardoso 2019 correlation","disabled"]
[null,null,null,null,null,null,null,null,null,null,{"$error":"#REF!"},{"$error":"#REF!"},0,0,0]
["Composition","Ethane [molar fraction]","Composition Data Source","=","user specified","mandatory",null,null,null,null,11,2,"=","user specified","mandatory"]
["Composition","Propane [molar fraction]","Composition Data Source","=","user specified","mandatory",null,null,null,null,12,2,"=","user specified","mandatory"]
["Composition","Butane [molar fraction]","Composition Data Source","=","user specified","mandatory",null,null,null,null,13,2,"=","user specified","mandatory"]
["Composition","Isobutane [molar fraction]","Composition Data Source","=","user specified","mandatory",null,null,null,null,14,2,"=","user specified","mandatory"]
["Composition","Pentane [molar fraction]","Composition Data Source","=","user specified","mandatory",null,null,null,null,15,2,"=","user specified","mandatory"]
["Composition","Isopentane [molar fraction]","Composition Data Source","=","user specified","mandatory",null,null,null,null,16,2,"=","user specified","mandatory"]
["Composition","Hexanes [molar fraction]","Composition Data Source","=","user specified","mandatory",null,null,null,null,17,2,"=","user specified","mandatory"]
["Composition","CO2 [molar fraction]","Composition Data Source","=","user specified","mandatory",null,null,null,null,18,2,"=","user specified","mandatory"]
["Composition","N2 [molar fraction]","Composition Data Source","=","user specified","mandatory",null,null,null,null,19,2,"=","user specified","mandatory"]
["Composition","H2S [molar fraction]","Composition Data Source","=","user specified","mandatory",null,null,null,null,20,2,"=","user specified","mandatory"]
[null,null,null,null,null,null,null,null,null,null,{"$error":"#REF!"},{"$error":"#REF!"},0,0,0]
["Composition","2nd Stage Pressure [psia]","Number of Separator Stages","=",1,"disabled",null,null,null,null,9,4,"=",1,"disabled"]
[null,null,null,null,null,null,null,null,null,null,{"$error":"#REF!"},{"$error":"#REF!"},0,0,0]
["Composition","API Gravity","Condensate (or OIL) formation","=","no","disabled",null,null,null,null,5,3,"=","no","disabled"]
["Composition","Gas to Oil Ratio [scf/bbl]","Condensate (or OIL) formation","=","no","disabled",null,null,null,null,6,3,"=","no","disabled"]
[null,null,null,null,null,null,null,null,null,null,{"$error":"#REF!"},{"$error":"#REF!"},0,0,0]
{"$rows_left_out":143}
{"sheet":"InternalUseOnly_Validation","index":6,"n_rows":139,"n_cols":13,"rows_kept":139,"cut":false,"hidden":true,"merged":[]}
["Sheet","Excel Column","Intake Data Key","Required/Optional/Not Used","Valid values"]
["Global_Simulation_Parameters","Plot Interval",null,"Required","SECONDS","MINUTES","HOURS","DAYS","MONTHS","YEARS"]
["Facility_List","Facility_ID","facilityID","Required"]
["Facility_List","Latitude","facilityLat","Required"]
["Facility_List","Longitude","facilityLong","Required"]
["Facility_List","Sector","sector","Required","Production","Gathering and Boosting","Processing","Transmission and Storage"]
["Facility_List","Leak Emission Data Source","leakDataSource","Required","User specified","Gathering Compressor Station Study (CSU)","Transmission and Storage Compressor Station Study (CSU)","U.S. EPA Greenhouse Gas Reporting Program (GHGRP)"]
["Facility_List","Leak Survey Method","surveyMethod","Required","OGI, Method 21, Infrared, or Acoustic","Method 21 as specified in §60.5397a"]
["Facility_List","Filename for User Specified Leaks","userLeakFile","Optional"]
["Facility_List","Pneumatic Data Source","pneumaticDataSource","Required","U.S. EPA Greenhouse Gas Reporting Program (GHGRP)","Allen 2015 EF","Allen 2015 EF; Allen 2020 Abnormal Operation"]
["Facility_List","Reporting Year","reportingYear","Required",2018,2017,2016,2015]
["Facility_List","Region","region","Required","Eastern","Western"]
["Facility_List","Composition Profile ID","profile_id","Required","=Composition!$A$2:$A$1048576"]
["Composition","Composition Profile ID","profile_id","Required"]
["Composition","Composition Data Source","profileDataSource","Required","user specified","thermodynamics","Cardoso 2019 correlation","AP-42","Subpart_C"]
["Composition","Condensate (or OIL) formation","condensate_prod","Required","yes","no"]
["Composition","Number of Separator Stages","n_stages","Required",1,2]
["Composition","API Gravity","api_gravity"]
["Composition","Gas to Oil Ratio [scf/bbl]","gor"]
["Composition","Temperature [F]","temp"]
["Composition","1st Stage Pressure [psia]","p1"]
["Composition","2nd Stage Pressure [psia]","p2"]
["Composition","Methane [molar fraction]","methane"]
["Composition","Ethane [molar fraction]","ethane"]
["Composition","Propane [molar fraction]","propane"]
["Composition","Butane [molar fraction]","butane"]
["Composition","Isobutane [molar fraction]","isobutane"]
["Composition","Pentane [molar fraction]","pentane"]
["Composition","Isopentane [molar fraction]","isopentane"]
["Composition","Hexanes [molar fraction]","hexanes"]
["Composition","CO2 [molar fraction]","carbon_dioxide"]
["Composition","N2 [molar fraction]","nitrogen"]
["Composition","H2S [molar fraction]","hydrogen_sulfide"]
["Compressors","Compressor_ID","compressorID","Required"]
["Compressors","Facility_ID","facilityID","Required","=Facility_List!$A$2:$A$1048576"]
["Compressors","Type","compressorType","Required","Centrifugal","Reciprocating"]
["Compressors","Data Source","compressorDataSource","Required","Gathering Compressor Station Study (CSU)","Transmission and Storage Compressor Station Study (CSU)","U.S. EPA Greenhouse Gas Reporting Program (GHGRP)","User specified"]
["Compressors","Filename for User Specified Data Source","userCompressorFile","Optional"]
["Compressors","Driver Type","driverData.driverType","Optional",null,"Two stroke lean burn","Four stroke lean burn","Four stroke rich burn","Turbine","Electric motor"]
["Compressors","Driver Size [HP]","driverData.driverSize","Optional"]
["Compressors","Cylinders","driverData.cylinders","Optional"]
["Compressors","Seal Type","driverData.sealType","Optional",null,"Dry","Wet"]
["Compressors","Fuel Consumption [BTU/bhp-hr]","driverData.efficiency","Optional"]
["Compressors","Combustion Emission Reference","combustionEmissionReference","Required",null,"EPA AP-42","40 CFR Subpart C"]
["Compressors","Average Loading [%]","driverData.loading.mu","Optional"]
["Compressors","Loading Standard Deviation [%]","driverData.loading.sigma","Optional"]
["Compressors","OP Mode Hours per Year [Hours]","operationData.uptime","Optional"]
["Compressors","NOP Mode Hours per Year [Hours]","operationData.percentNOP","Optional"]
["Compressors","NOD Mode Hours per Year [Hours]","operationData.percentNOD","Optional"]
["Compressors","OP Mode Runtime [Hours]","operationData.opTime","Optional"]
["Compressors","NOP Mode Runtime [Hours]","operationData.nopTime","Optional"]
["Compressors","NOD Mode Runtime [Hours]","operationData.nodTime","Optional"]
["Compressors","Starter Vent Emission Volume [SCF]","starterVentVolume","Optional"]
["Compressors","Starter Vent Duration [s]","starterVentDuration","Optional"]
["Compressors","Blowdown Vent Emission Volume [SCF]","blowdownVentVolume","Optional"]
["Compressors","Blowdown Vent Duration [s]","blowdownVentDuration","Optional"]
["Dehydrators","Dehydrator_ID","dehydratorID","Required"]
["Dehydrators","Facility_ID","facilityID","Required","=Facility_List!$A$2:$A$1048576"]
["Dehydrators","Throughput","dehydratorType","Required","< 0.4 MMSCF/day","≥ 0.4 MMSCF/day"]
["Dehydrators","Sector","sector","Required","Production","Gathering and Boosting","Processing","Transmission and Storage"]
{"$rows_left_out":79}